{"text_format":"1","workbook":"xlsx","n_sheets":3,"sheets":["ENG","Fakturering","Faktura"],"not_rendered":{"charts":0,"images":2,"macros":1,"external_links":0,"defined_names":6,"comments":3,"pivot_tables":0},"unopened":[],"bounds":{"document_bytes":16777216,"sheet_cells":100000,"rows_first":2000,"rows_last":500,"rows_between":2000,"halvings":0,"cell_chars":16384,"cell_head_chars":4096},"cells_cut":0,"cells_raw":0,"read":"whole","date_system":"1900"}

{"sheet":"ENG","index":0,"n_rows":161,"n_cols":23,"rows_kept":161,"cut":false,"hidden":false,"merged":[[8,1,8,3],[17,1,17,9],[18,1,18,9],[20,1,20,9],[21,1,21,9],[22,1,22,9],[24,1,24,9],[11,1,11,9],[14,1,14,9],[0,8,0,9],[69,1,69,3],[69,8,69,9],[70,1,70,3],[70,8,70,9],[67,1,67,3],[67,8,67,9],[68,1,68,3],[68,8,68,9],[64,8,64,9],[50,0,50,9],[51,0,51,9],[52,0,52,9],[60,8,60,9],[60,4,60,7],[30,1,30,9],[31,1,31,9],[32,1,32,9],[33,1,33,9],[46,0,46,9],[25,1,25,9],[1,0,1,9],[2,0,2,9],[6,0,6,9],[36,1,43,9],[65,8,65,9],[66,8,66,9],[61,8,61,9],[62,8,62,9],[63,8,63,9],[48,0,48,9],[49,0,49,9],[61,1,61,3],[62,1,62,3],[63,1,63,3],[66,1,66,3],[65,1,65,3],[64,1,64,3],[61,4,61,7],[62,4,62,7],[63,4,63,7],[64,4,64,7],[65,4,65,7],[150,1,150,2],[149,1,149,2],[148,1,148,2],[147,1,147,2],[146,1,146,2],[73,4,73,5],[153,1,153,9],[157,1,157,9],[161,1,161,9],[75,2,75,5],[76,2,76,5],[77,2,77,5],[78,2,78,5],[79,2,79,5],[84,2,84,5],[80,2,80,5],[81,2,81,5],[82,2,82,5],[83,2,83,5],[85,2,85,5],[86,2,86,5],[87,2,87,5],[88,2,88,5],[89,2,89,5],[66,4,66,7],[67,4,67,7],[68,4,68,7],[69,4,69,7],[70,4,70,7],[99,2,99,5],[90,2,90,5],[91,2,91,5],[92,2,92,5],[93,2,93,5],[94,2,94,5],[95,2,95,5],[97,2,97,5],[98,2,98,5],[96,2,96,5],[147,3,147,8],[148,3,148,8],[149,3,149,8],[140,3,140,8],[141,3,141,8],[142,3,142,8],[143,3,143,8],[144,3,144,8],[150,3,150,8],[145,3,145,8],[146,3,146,8],[135,3,135,8],[136,3,136,8],[137,3,137,8],[138,3,138,8],[139,3,139,8],[145,1,145,2],[144,1,144,2],[143,1,143,2],[142,1,142,2],[141,1,141,2],[140,1,140,2],[135,1,135,2],[136,1,136,2],[137,1,137,2],[138,1,138,2],[139,1,139,2]]}
[null,null,null,null,null,null,null,null,"P.O. Box 570, DK-3900 Nuuk, Greenland\nPhone:   +299 36 12 00 \nFax:  +299 36 12 12"]
["Application for logistics support at \nGreenland Institute of Natural Resources\n"]
[]
["Reserved for GINR (Booking number)"]
[]
[]
["Basic information"]
["*1) Date of application (DD-MM-YY)",null,null,null,null,"*2) GINR / GCRC project number – if available"]
[null,null,null,null,null,null,null,"Vælg"]
[]
["*3) Project title "]
[]
[]
["*4) Name of principal investigator / projekt leader (PI)",null,null,null,null,"/ Samarbejde med afdeling i GINR? Tilknyttet til:"]
[]
[]
["*e) Invoice address",null,null,null,"Payment"]
["Company name"]
["Responsible",null,null,null,null,null,null,null,null,null,"Ekstra linje som står: Tilknyttet til afdeling?"]
["Street name"]
["Zip code"]
["City"]
["Phone nr."]
["E-mail"]
["EAN Nr./GLN"]
["VAT"]
[]
["*5) Invoice payment",null,null,"Kreditkort",null,null,"Send an invoice"]
[]
["*6) Contact person while/if PI is in the field"]
["Name:"]
["Adresse:"]
["Phone:"]
["E-mail:"]
[]
["* 7) Brief description of project"]
[]
[]
[]
[]
[]
[]
[]
[]
[]
[]
["Standard terms & conditions"]
[]
["· GINR is not able to undertake housing of customer equipment within or between field  seasons."]
["· All special equipment and consumables - including weapons, clothing, equipment for communication, navigation and camping - necessary to carry out a project at GINR must be provided by the individual project itself."]
["· GINR will normally not charge services before they are completed. However, in all cases, GINR reserves the right to charge the full amount of any given service immediately after a booking has been agreed. "]
["· All types of bookings may be cancelled by the costumer free of charge until 7 calendar days before delivery of the booked service. If the costumer cancels his booking later than 7 calendar days before completion – or does not show up at all at the time agreed - GINR reserves the right to charge the full amount of the service booked."]
["Specification of need for logistics support"]
[]
["1) Boat transport"]
["Driver:","With driver",null,null,null,null,null,null,null,null,null,"med elektrisk spil 100 m "]
["Work :","On water",null,null,null,null,null,null,null,null,null,"med hydralik spil 1000m"]
["2)",null,null,null,null,null,null,null,null,null,null,"med hydralik garn spil 1000m"]
[]
["How many person",null,3]
{"$rows_left_out":102}
{"sheet":"Fakturering","index":1,"n_rows":39,"n_cols":37,"rows_kept":39,"cut":false,"hidden":false,"merged":[[37,2,37,10],[37,12,37,17],[38,2,41,10],[38,12,38,24],[39,12,39,24],[4,22,4,24],[0,0,0,18],[0,19,0,20],[36,39,36,41],[36,43,36,45]]}
[null,null,null,null,null,null,null,null,null,null,null,null,null,null,null,null,null,null,null,"Projektnummer:",null,null,{"$f":"ENG!H9","v":"Vælg"},null,{"$f":"ENG!F9","v":0}]
[null,null,null,null,null,null,null,null,null,null,null,null,null,null,"Intern:",null,{"$f":"IF(ENG!H9=\"Intern\",\"x\",0)","v":0}]
[null,null,null,null,null,null,null,null,null,null,null,null,null,null,"Intern vakantbolig:",null,null,{"$f":"Q3","v":0}," "]
[null,null,null,null,null,null,null,null,null,null,null,null,null,null,"Student"]
[null,null,null,null,null,null,null,null,null,null,null,null,null,null,"Ekstern betaler:",null,{"$f":"IF(ENG!H9=\"Ekstern\",\"x\",0)","v":0},null,null,null,null,null,{"$f":"ENG!B19","v":0}]
["Logi",null,null,null,null,null,null,"Bolig","Pris",null,"Ankomst dato",null,"Afrejse dato",null,"Antal dag",null,null,null,"Rengøring",null,"Oprind.beløb",null,"Max",null,"pris i alt (inkl.reng)"]
[{"$f":"#REF!","v":{"$error":"#REF!"}},null,null,null,null,null,null,{"$f":"#REF!","v":{"$error":"#REF!"}},{"$f":"IF(H7=\"FV\",400,0)+IF(H7=\"FL2\",500,0)+IF(H7=\"FL3\",650,0)+IF(H7=\"FL4\",800,0)+IF(H7=\"BIO\",400,0)+IF(H7=\"NBFL\",500,0)","v":{"$error":"#REF!"}},null,{"$f":"#REF!","v":{"$error":"#REF!"}},null,{"$f":"#REF!","v":{"$error":"#REF!"}},null,{"$f":"M7-K7","v":{"$error":"#REF!"}},null,null,null,{"$f":"IF(H7=\"NBFL\",500,0+IF(H7=\"FV\",300,0+IF(H7=\"FL2\",1500,0+IF(H7=\"FL3\",1500,0+IF(H7=\"FL4\",1500,0+IF(H7=\"BIO\",400,0))))))","v":{"$error":"#REF!"}},null,{"$f":"I7*O7","v":{"$error":"#REF!"}},null,{"$f":"VLOOKUP(Fakturering!O7,#REF!,IF(Fakturering!H7=\"FV\",\"4\",IF(Fakturering!H7=\"FL2\",\"7\",IF(Fakturering!H7=\"FL3\",\"10\",IF(Fakturering!H7=\"FL4\",\"13\",IF(Fakturering!H7=\"NBFL\",\"16\",IF(Fakturering!H7=\"BIO\",\"19\",\"0\")))))),FALSE)","v":{"$error":"#REF!"}},null,{"$f":"W7+S7","v":{"$error":"#REF!"}},"Kredit:",2110,"/",84,"-","0",{"$f":"IF(H7=\"FV\",8,0+IF(H7=\"FL2\",8,0+IF(H7=\"FL3\",8,0+IF(H7=\"FL4\",8,0+IF(H7=\"NBFL\",8,0+IF(H7=\"BIO\",6,0+HVIS))))))","v":{"$error":"#REF!"}},"=>",{"$f":"A7","v":{"$error":"#REF!"}},null,{"$f":"O7","v":{"$error":"#REF!"}},"nætter"]
[{"$f":"#REF!","v":{"$error":"#REF!"}},null,null,null,null,null,null,{"$f":"#REF!","v":{"$error":"#REF!"}},{"$error":"#REF!"},null,{"$f":"#REF!","v":{"$error":"#REF!"}},null,{"$f":"#REF!","v":{"$error":"#REF!"}},null,{"$f":"M8-K8","v":{"$error":"#REF!"}},null,null,null,{"$error":"#REF!"},null,{"$f":"I8*O8","v":{"$error":"#REF!"}},null,{"$f":"VLOOKUP(Fakturering!O8,#REF!,IF(Fakturering!H8=\"FV\",\"4\",IF(Fakturering!H8=\"FL2\",\"7\",IF(Fakturering!H8=\"FL3\",\"10\",IF(Fakturering!H8=\"FL4\",\"13\",IF(Fakturering!H8=\"NBFL\",\"16\",IF(Fakturering!H8=\"BIO\",\"19\",\"0\")))))),FALSE)","v":{"$error":"#REF!"}},null,{"$f":"W8+S8","v":{"$error":"#REF!"}},"Kredit:",2110,"/",84,"-","0",{"$f":"IF(H8=\"FV\",8,0+IF(H8=\"FL2\",8,0+IF(H8=\"FL3\",8,0+IF(H8=\"FL4\",8,0+IF(H8=\"NBFL\",8,0+IF(H8=\"BIO\",6,0))))))","v":{"$error":"#REF!"}},"=>",{"$error":"#REF!"},null,{"$error":"#REF!"},"nætter"]
[{"$f":"#REF!","v":{"$error":"#REF!"}},null,null,null,null,null,null,{"$f":"#REF!","v":{"$error":"#REF!"}},{"$error":"#REF!"},null,{"$f":"#REF!","v":{"$error":"#REF!"}},null,{"$f":"#REF!","v":{"$error":"#REF!"}},null,{"$f":"M9-K9","v":{"$error":"#REF!"}},null,null,null,{"$error":"#REF!"},null,{"$error":"#REF!"},null,{"$f":"VLOOKUP(Fakturering!O9,#REF!,IF(Fakturering!H9=\"FV\",\"4\",IF(Fakturering!H9=\"FL2\",\"7\",IF(Fakturering!H9=\"FL3\",\"10\",IF(Fakturering!H9=\"FL4\",\"13\",IF(Fakturering!H9=\"NBFL\",\"16\",IF(Fakturering!H9=\"BIO\",\"19\",\"0\")))))),FALSE)","v":{"$error":"#REF!"}},null,{"$error":"#REF!"},"Kredit:",2110,"/",84,"-","0",{"$f":"IF(H9=\"FV\",8,0+IF(H9=\"FL2\",8,0+IF(H9=\"FL3\",8,0+IF(H9=\"FL4\",8,0+IF(H9=\"NBFL\",8,0+IF(H9=\"BIO\",6,0))))))","v":{"$error":"#REF!"}},"=>",{"$error":"#REF!"},null,{"$error":"#REF!"},"nætter"]
[{"$f":"#REF!","v":{"$error":"#REF!"}},null,null,null,null,null,null,{"$f":"#REF!","v":{"$error":"#REF!"}},{"$error":"#REF!"},null,{"$f":"#REF!","v":{"$error":"#REF!"}},null,{"$f":"#REF!","v":{"$error":"#REF!"}},null,{"$error":"#REF!"},null,null,null,{"$error":"#REF!"},null,{"$error":"#REF!"},null,{"$f":"VLOOKUP(Fakturering!O10,#REF!,IF(Fakturering!H10=\"FV\",\"4\",IF(Fakturering!H10=\"FL2\",\"7\",IF(Fakturering!H10=\"FL3\",\"10\",IF(Fakturering!H10=\"FL4\",\"13\",IF(Fakturering!H10=\"NBFL\",\"16\",IF(Fakturering!H10=\"BIO\",\"19\",\"0\")))))),FALSE)","v":{"$error":"#REF!"}},null,{"$f":"W10+S10","v":{"$error":"#REF!"}},"Kredit:",2110,"/",84,"-","0",{"$f":"IF(H10=\"FV\",8,0+IF(H10=\"FL2\",8,0+IF(H10=\"FL3\",8,0+IF(H10=\"FL4\",8,0+IF(H10=\"NBFL\",8,0+IF(H10=\"BIO\",6,0))))))","v":{"$error":"#REF!"}},"=>",{"$error":"#REF!"},null,{"$error":"#REF!"},"nætter"]
[{"$f":"#REF!","v":{"$error":"#REF!"}},null,null,null,null,null,null,{"$f":"#REF!","v":{"$error":"#REF!"}},{"$error":"#REF!"},null,{"$f":"#REF!","v":{"$error":"#REF!"}},null,{"$f":"#REF!","v":{"$error":"#REF!"}},null,{"$error":"#REF!"},null,null,null,{"$error":"#REF!"},null,{"$error":"#REF!"},null,{"$f":"VLOOKUP(Fakturering!O11,#REF!,IF(Fakturering!H11=\"FV\",\"4\",IF(Fakturering!H11=\"FL2\",\"7\",IF(Fakturering!H11=\"FL3\",\"10\",IF(Fakturering!H11=\"FL4\",\"13\",IF(Fakturering!H11=\"NBFL\",\"16\",IF(Fakturering!H11=\"BIO\",\"19\",\"0\")))))),FALSE)","v":{"$error":"#REF!"}},null,{"$error":"#REF!"},"Kredit:",2110,"/",84,"-","0",{"$f":"IF(H11=\"FV\",8,0+IF(H11=\"FL2\",8,0+IF(H11=\"FL3\",8,0+IF(H11=\"FL4\",8,0+IF(H11=\"NBFL\",8,0+IF(H11=\"BIO\",6,0))))))","v":{"$error":"#REF!"}},"=>",{"$error":"#REF!"},null,{"$error":"#REF!"},"nætter"]
[{"$f":"#REF!","v":{"$error":"#REF!"}},null,null,null,null,null,null,{"$f":"#REF!","v":{"$error":"#REF!"}},{"$error":"#REF!"},null,{"$f":"#REF!","v":{"$error":"#REF!"}},null,{"$f":"#REF!","v":{"$error":"#REF!"}},null,{"$error":"#REF!"},null,null,null,{"$error":"#REF!"},null,{"$error":"#REF!"},null,{"$f":"VLOOKUP(Fakturering!O12,#REF!,IF(Fakturering!H12=\"FV\",\"4\",IF(Fakturering!H12=\"FL2\",\"7\",IF(Fakturering!H12=\"FL3\",\"10\",IF(Fakturering!H12=\"FL4\",\"13\",IF(Fakturering!H12=\"NBFL\",\"16\",IF(Fakturering!H12=\"BIO\",\"19\",\"0\")))))),FALSE)","v":{"$error":"#REF!"}},null,{"$error":"#REF!"},"Kredit:",2110,"/",84,"-","0",{"$error":"#REF!"},"=>",{"$error":"#REF!"},null,{"$error":"#REF!"},"nætter"]
[{"$f":"#REF!","v":{"$error":"#REF!"}},null,null,null,null,null,null,{"$f":"#REF!","v":{"$error":"#REF!"}},{"$error":"#REF!"},null,{"$f":"#REF!","v":{"$error":"#REF!"}},null,{"$f":"#REF!","v":{"$error":"#REF!"}},null,{"$error":"#REF!"},null,null,null,{"$error":"#REF!"},null,{"$error":"#REF!"},null,{"$f":"VLOOKUP(Fakturering!O13,#REF!,IF(Fakturering!H13=\"FV\",\"4\",IF(Fakturering!H13=\"FL2\",\"7\",IF(Fakturering!H13=\"FL3\",\"10\",IF(Fakturering!H13=\"FL4\",\"13\",IF(Fakturering!H13=\"NBFL\",\"16\",IF(Fakturering!H13=\"BIO\",\"19\",\"0\")))))),FALSE)","v":{"$error":"#REF!"}},null,{"$error":"#REF!"},"Kredit:",2110,"/",84,"-","0",{"$error":"#REF!"},"=>",{"$error":"#REF!"},null,{"$error":"#REF!"},"nætter"]
[{"$f":"#REF!","v":{"$error":"#REF!"}},null,null,null,null,null,null,{"$f":"#REF!","v":{"$error":"#REF!"}},{"$error":"#REF!"},null,{"$f":"#REF!","v":{"$error":"#REF!"}},null,{"$f":"#REF!","v":{"$error":"#REF!"}},null,{"$error":"#REF!"},null,null,null,{"$error":"#REF!"},null,{"$error":"#REF!"},null,{"$f":"VLOOKUP(Fakturering!O14,#REF!,IF(Fakturering!H14=\"FV\",\"4\",IF(Fakturering!H14=\"FL2\",\"7\",IF(Fakturering!H14=\"FL3\",\"10\",IF(Fakturering!H14=\"FL4\",\"13\",IF(Fakturering!H14=\"NBFL\",\"16\",IF(Fakturering!H14=\"BIO\",\"19\",\"0\")))))),FALSE)","v":{"$error":"#REF!"}},null,{"$error":"#REF!"},"Kredit:",2110,"/",84,"-","0",{"$error":"#REF!"},"=>",{"$error":"#REF!"},null,{"$error":"#REF!"},"nætter"]
[{"$f":"#REF!","v":{"$error":"#REF!"}},null,null,null,null,null,null,{"$f":"#REF!","v":{"$error":"#REF!"}},{"$error":"#REF!"},null,{"$f":"#REF!","v":{"$error":"#REF!"}},null,{"$f":"#REF!","v":{"$error":"#REF!"}},null,{"$error":"#REF!"},null,null,null,{"$error":"#REF!"},null,{"$error":"#REF!"},null,{"$f":"VLOOKUP(Fakturering!O15,#REF!,IF(Fakturering!H15=\"FV\",\"4\",IF(Fakturering!H15=\"FL2\",\"7\",IF(Fakturering!H15=\"FL3\",\"10\",IF(Fakturering!H15=\"FL4\",\"13\",IF(Fakturering!H15=\"NBFL\",\"16\",IF(Fakturering!H15=\"BIO\",\"19\",\"0\")))))),FALSE)","v":{"$error":"#REF!"}},null,{"$error":"#REF!"},"Kredit:",2110,"/",84,"-","0",{"$error":"#REF!"},"=>",{"$error":"#REF!"},null,{"$error":"#REF!"},"nætter"]
[{"$f":"#REF!","v":{"$error":"#REF!"}},null,null,null,null,null,null,{"$f":"#REF!","v":{"$error":"#REF!"}},{"$error":"#REF!"},null,{"$f":"#REF!","v":{"$error":"#REF!"}},null,{"$f":"#REF!","v":{"$error":"#REF!"}},null,{"$error":"#REF!"},null,null,null,{"$error":"#REF!"},null,{"$error":"#REF!"},null,{"$f":"VLOOKUP(Fakturering!O16,#REF!,IF(Fakturering!H16=\"FV\",\"4\",IF(Fakturering!H16=\"FL2\",\"7\",IF(Fakturering!H16=\"FL3\",\"10\",IF(Fakturering!H16=\"FL4\",\"13\",IF(Fakturering!H16=\"NBFL\",\"16\",IF(Fakturering!H16=\"BIO\",\"19\",\"0\")))))),FALSE)","v":{"$error":"#REF!"}},null,{"$error":"#REF!"},"Kredit:",2110,"/",84,"-","0",{"$error":"#REF!"},"=>",{"$error":"#REF!"},null,{"$error":"#REF!"},"nætter"]
[]
["Kantine"]
[null,null,null,null,null,null,null,"Lunch",null,null,"Fra den",null,"Til og med",null,"Helligdag"]
[{"$f":"ENG!B76","v":1},null,null,null,null,null,null,{"$f":"NETWORKDAYS(ENG!I76,ENG!J76,#REF!+#REF!+#REF!)","v":{"$error":"#REF!"}},{"$f":"IF(H20>0,50,0)","v":{"$error":"#REF!"}},null,{"$f":"ENG!I76","v":"13:00:00"},null,{"$f":"ENG!J76","v":"00:00:00"},null,0,null,{"$f":"H20-O20","v":{"$error":"#REF!"}},null,null,null,null,null,null,null,{"$f":"Q20*I20","v":{"$error":"#REF!"}},"Kredit:",2110,"/",81,"-",0,8,"=>",{"$f":"A20","v":1},null,"Kantine x",{"$f":"Q20","v":{"$error":"#REF!"}}]
[{"$f":"ENG!B77","v":0},null,null,null,null,null,null,{"$f":"NETWORKDAYS(ENG!I77,ENG!J77,#REF!+#REF!+#REF!)","v":{"$error":"#REF!"}},{"$f":"IF(H21>0,50,0)","v":{"$error":"#REF!"}},null,{"$f":"ENG!I77","v":"00:00:00"},null,{"$f":"ENG!J77","v":"00:00:00"},null,0,null,{"$f":"H21-O21","v":{"$error":"#REF!"}},null,null,null,null,null,null,null,{"$f":"Q21*I21","v":{"$error":"#REF!"}},"Kredit:",2110,"/",81,"-",0,8,"=>",0,null,"Kantine x",{"$f":"Q21","v":{"$error":"#REF!"}}]
[{"$f":"ENG!B78","v":0},null,null,null,null,null,null,{"$f":"NETWORKDAYS(ENG!I78,ENG!J78,#REF!+#REF!+#REF!)","v":{"$error":"#REF!"}},{"$error":"#REF!"},null,{"$f":"ENG!I78","v":"00:00:00"},null,{"$f":"ENG!J78","v":"00:00:00"},null,0,null,{"$f":"H22-O22","v":{"$error":"#REF!"}},null,null,null,null,null,null,null,{"$error":"#REF!"},"Kredit:",2110,"/",81,"-",0,8,"=>",0,null,"Kantine x",{"$f":"Q9","v":0}]
[{"$f":"ENG!B79","v":0},null,null,null,null,null,null,{"$f":"NETWORKDAYS(ENG!I79,ENG!J79,#REF!+#REF!+#REF!)","v":{"$error":"#REF!"}},{"$error":"#REF!"},null,{"$f":"ENG!I79","v":"00:00:00"},null,{"$f":"ENG!J79","v":"00:00:00"},null,0,null,{"$error":"#REF!"},null,null,null,null,null,null,null,{"$error":"#REF!"},"Kredit:",2110,"/",81,"-",0,8,"=>",0,null,"Kantine x",0]
[{"$f":"ENG!B80","v":0},null,null,null,null,null,null,{"$f":"NETWORKDAYS(ENG!I80,ENG!J80,#REF!+#REF!+#REF!)","v":{"$error":"#REF!"}},{"$error":"#REF!"},null,{"$f":"ENG!I80","v":"00:00:00"},null,{"$f":"ENG!J80","v":"00:00:00"},null,0,null,{"$error":"#REF!"},null,null,null,null,null,null,null,{"$error":"#REF!"},"Kredit:",2110,"/",81,"-",0,8,"=>",0,null,"Kantine x",0]
[{"$f":"ENG!B81","v":0},null,null,null,null,null,null,{"$f":"NETWORKDAYS(ENG!I81,ENG!J81,#REF!+#REF!+#REF!)","v":{"$error":"#REF!"}},{"$error":"#REF!"},null,{"$f":"ENG!I81","v":"00:00:00"},null,{"$f":"ENG!J81","v":"00:00:00"},null,0,null,{"$error":"#REF!"},null,null,null,null,null,null,null,{"$error":"#REF!"},"Kredit:",2110,"/",81,"-",0,8,"=>",0,null,"Kantine x",0]
[{"$f":"ENG!B82","v":0},null,null,null,null,null,null,{"$f":"NETWORKDAYS(ENG!I82,ENG!J82,#REF!+#REF!+#REF!)","v":{"$error":"#REF!"}},{"$error":"#REF!"},null,{"$f":"ENG!I82","v":"00:00:00"},null,{"$f":"ENG!J82","v":"00:00:00"},null,0,null,{"$error":"#REF!"},null,null,null,null,null,null,null,{"$error":"#REF!"},"Kredit:",2110,"/",81,"-",0,8,"=>",0,null,"Kantine x",0]
[{"$f":"ENG!B83","v":0},null,null,null,null,null,null,{"$f":"NETWORKDAYS(ENG!I83,ENG!J83,#REF!+#REF!+#REF!)","v":{"$error":"#REF!"}},{"$error":"#REF!"},null,{"$f":"ENG!I83","v":"00:00:00"},null,{"$f":"ENG!J83","v":"00:00:00"},null,0,null,{"$error":"#REF!"},null,null,null,null,null,null,null,{"$error":"#REF!"},"Kredit:",2110,"/",81,"-",0,8,"=>",0,null,"Kantine x",0]
[{"$f":"ENG!B84","v":0},null,null,null,null,null,null,{"$f":"NETWORKDAYS(ENG!I84,ENG!J84,#REF!+#REF!+#REF!)","v":{"$error":"#REF!"}},{"$error":"#REF!"},null,{"$f":"ENG!I84","v":"00:00:00"},null,{"$f":"ENG!J84","v":"00:00:00"},null,0,null,{"$error":"#REF!"},null,null,null,null,null,null,null,{"$error":"#REF!"},"Kredit:",2110,"/",81,"-",0,8,"=>",0,null,"Kantine x",0]
[{"$f":"ENG!B85","v":0},null,null,null,null,null,null,{"$f":"NETWORKDAYS(ENG!I85,ENG!J85,#REF!+#REF!+#REF!)","v":{"$error":"#REF!"}},{"$error":"#REF!"},null,{"$f":"ENG!I85","v":"00:00:00"},null,{"$f":"ENG!J85","v":"00:00:00"},null,0,null,{"$error":"#REF!"},null,null,null,null,null,null,null,{"$error":"#REF!"},"Kredit:",2110,"/",81,"-",0,8,"=>",0,null,"Kantine x",0]
[]
["Ekstra Service",null,null,null,200,null,null,"antal"]
["Ekstra seng",null,null,null,300,null,null,0,200,null,null,null,null,null,null,null,null,null,null,null,null,null,null,null,{"$f":"I32*H32","v":0},"Kredit:",{"$f":"AA7","v":2110},"/",{"$f":"AC7","v":84},"-","0",{"$error":"#REF!"},"=>",null,null,{"$f":"A32","v":"Ekstra seng"}]
["Ekstra rengøring",null,null,null,null,null,null,0,300,null,null,null,null,null,null,null,null,null,null,null,null,null,null,null,{"$f":"I33*H33","v":0},"Kredit:",{"$f":"AA8","v":2110},"/",84,"-","0",{"$error":"#REF!"},"=>",null,null,{"$f":"A33","v":"Ekstra rengøring"}]
[]
[null,null,null,null,null,null,null,null,null,null,null,null,null,null,null,null,null,null,null,null,null,null,null,null,{"$f":"SUMIF(Y7:Y16,\"<>\"&\"#I/T\")+(Y20+Y21+Y22+Y23+Y24+Y25+Y26+Y27+Y28+Y29+Y32+Y33)","v":{"$error":"#REF!"}}]
[null,null,null,null,null,null,null,null,null,null,null,null,null,null,"Studentermedhjælpere  50% - rabat på overnatninger",null,null,null,null,null,null,null,"-  50%",null,{"$f":"IF(Q4=\"x\",Y35*50%,0)","v":0}]
[null,null,null,null,null,null,null,null,null,null,null,null,null,null,null,null,null,null,null,null,null,null,null,null,{"$f":"Y35-Y36","v":{"$error":"#REF!"}},"Debit:",{"$f":"IF(W1=\"Intern\",1290,0+IF(W1=\"Ekstern\",9118,0+IF(W1=\"Ingen\",9118,0+IF(W1=\"Vælg\",9118,0))))","v":9118},"/",{"$f":"IF(W1=\"Ekstern\",22,0+IF(W1=\"Intern\", 79,0+IF(W1=\"ingen\",\"10\",0)))","v":0},"-",{"$f":"IF(W1=\"ingen\",0,0)","v":0},{"$f":"IF(W1=\"Ingen\",1,0+IF(W1=\"Intern\",Y1,0+IF(W1=\"Ekstern\",Y1,0+IF(W1=\"Vælg\",0.1,0))))","v":0.1},{"$f":"AG33","v":"=>"},{"$f":"IF(AA37=\"9116\",\"Fkt. Nr\",+W5)","v":0},null,"Logi Nuuk"]
[null,null,{"$f":"IF(Q5=0,\" \",\"Udfaktureres til \")","v":" "},null,null,null,null,null,null,null,null,null,null,null,null,null,null,null,null,null,null,null,null,null,null,"Debit:","1262","/",81,"-",null,{"$f":"Y1","v":0},{"$f":"AG13","v":"=>"},{"$f":"IF(AA38=\"9116\",\"Fkt. Nr\",+W5)","v":0},null,"Logi Nuuk"]
[null,null,null,null,null,null,null,null,null,null,null,null,{"$f":"IF(M38=\"Omar bin Laden, Afganistan\",\"Han betaler sgu nok ikke; udfyld felt N6 med debitors navn\",\" \")","v":" "}]

{"sheet":"Faktura","index":2,"n_rows":48,"n_cols":11,"rows_kept":48,"cut":false,"hidden":false,"merged":[[40,9,40,10],[43,9,43,10],[4,8,4,10],[15,9,15,10]]}
[]
[null,{"$f":"ENG!B18","v":0}]
[null,{"$f":"ENG!B19","v":0}]
[null,{"$f":"ENG!B20","v":0}]
[null,{"$f":"ENG!B21","v":0},null,null,null,null,null,"Invoice no."]
[null,{"$f":"ENG!B22","v":0},null,null,null,null,null,"Date:",null,{"$f":"ENG!#REF!","v":{"$error":"#REF!"}}]
[null,{"$f":"ENG!B23","v":0}]
[null,{"$f":"ENG!B24","v":0}]
[null,{"$f":"ENG!B25","v":0}]
[null,{"$f":"ENG!B26","v":0}]
[]
[null,"booking nr:",{"$f":"#REF!","v":{"$error":"#REF!"}}]
[]
[]
[]
[null,"days",null,null,null,null,null,"DDK",825,"DDK"]
[null,{"$f":"Fakturering!O7","v":{"$error":"#REF!"}},{"$f":"Fakturering!H7","v":{"$error":"#REF!"}},{"$f":"Fakturering!A7","v":{"$error":"#REF!"}},null,null,null,{"$f":"Fakturering!I7","v":{"$error":"#REF!"}},null,{"$f":"Fakturering!W7","v":{"$error":"#REF!"}}]
[null,{"$f":"Fakturering!O8","v":{"$error":"#REF!"}},{"$f":"Fakturering!H8","v":{"$error":"#REF!"}},{"$f":"Fakturering!A8","v":{"$error":"#REF!"}},null,null,null,{"$f":"Fakturering!I8","v":{"$error":"#REF!"}},null,{"$f":"Fakturering!W8","v":{"$error":"#REF!"}}]
[null,{"$f":"Fakturering!O9","v":{"$error":"#REF!"}},{"$f":"Fakturering!H9","v":{"$error":"#REF!"}},{"$f":"Fakturering!A9","v":{"$error":"#REF!"}},null,null,null,{"$f":"Fakturering!I9","v":{"$error":"#REF!"}},null,{"$f":"Fakturering!W9","v":{"$error":"#REF!"}}]
[null,{"$f":"Fakturering!O10","v":{"$error":"#REF!"}},{"$f":"Fakturering!H10","v":{"$error":"#REF!"}},{"$f":"Fakturering!A10","v":{"$error":"#REF!"}},null,null,null,{"$f":"Fakturering!I10","v":{"$error":"#REF!"}},null,{"$f":"Fakturering!W10","v":{"$error":"#REF!"}}]
[null,{"$f":"Fakturering!O11","v":{"$error":"#REF!"}},{"$f":"Fakturering!H11","v":{"$error":"#REF!"}},{"$f":"Fakturering!A11","v":{"$error":"#REF!"}},null,null,null,{"$f":"Fakturering!I11","v":{"$error":"#REF!"}},null,{"$f":"Fakturering!W11","v":{"$error":"#REF!"}}]
[null,{"$f":"Fakturering!O12","v":{"$error":"#REF!"}},{"$f":"Fakturering!H12","v":{"$error":"#REF!"}},{"$f":"Fakturering!A12","v":{"$error":"#REF!"}},null,null,null,{"$f":"Fakturering!I12","v":{"$error":"#REF!"}},null,{"$f":"Fakturering!W12","v":{"$error":"#REF!"}}]
[null,{"$f":"Fakturering!O13","v":{"$error":"#REF!"}},{"$f":"Fakturering!H13","v":{"$error":"#REF!"}},{"$f":"Fakturering!A13","v":{"$error":"#REF!"}},null,null,null,{"$f":"Fakturering!I13","v":{"$error":"#REF!"}},null,{"$f":"Fakturering!W13","v":{"$error":"#REF!"}}]
[null,{"$f":"Fakturering!O14","v":{"$error":"#REF!"}},{"$f":"Fakturering!H14","v":{"$error":"#REF!"}},{"$f":"Fakturering!A14","v":{"$error":"#REF!"}},null,null,null,{"$f":"Fakturering!I14","v":{"$error":"#REF!"}},null,{"$f":"Fakturering!W14","v":{"$error":"#REF!"}}]
[null,{"$f":"Fakturering!O15","v":{"$error":"#REF!"}},{"$f":"Fakturering!H15","v":{"$error":"#REF!"}},{"$f":"Fakturering!A15","v":{"$error":"#REF!"}},null,null,null,{"$f":"Fakturering!I15","v":{"$error":"#REF!"}},null,{"$f":"Fakturering!W15","v":{"$error":"#REF!"}}]
[null,{"$f":"Fakturering!O16","v":{"$error":"#REF!"}},{"$f":"Fakturering!H16","v":{"$error":"#REF!"}},{"$f":"Fakturering!A16","v":{"$error":"#REF!"}},null,null,null,{"$f":"Fakturering!I16","v":{"$error":"#REF!"}},null,{"$f":"Fakturering!W16","v":{"$error":"#REF!"}}]
[null,{"$f":"Fakturering!H19","v":"Lunch"}]
[null,{"$f":"Fakturering!Q20","v":{"$error":"#REF!"}},{"$f":"ENG!B76","v":1},null,null,null,null,{"$f":"Fakturering!I20","v":{"$error":"#REF!"}},null,{"$f":"H28*B28","v":{"$error":"#REF!"}}]
[null,{"$f":"Fakturering!Q21","v":{"$error":"#REF!"}},{"$f":"ENG!B77","v":0},null,null,null,null,{"$f":"Fakturering!I21","v":{"$error":"#REF!"}},null,{"$error":"#REF!"}]
[null,{"$f":"Fakturering!Q22","v":{"$error":"#REF!"}},{"$f":"ENG!B78","v":0},null,null,null,null,{"$f":"Fakturering!I22","v":{"$error":"#REF!"}},null,{"$error":"#REF!"}]
[null,{"$f":"Fakturering!Q23","v":{"$error":"#REF!"}},{"$f":"ENG!B79","v":0},null,null,null,null,{"$f":"Fakturering!I23","v":{"$error":"#REF!"}},null,{"$error":"#REF!"}]
[null,{"$f":"Fakturering!Q24","v":{"$error":"#REF!"}},{"$f":"ENG!B80","v":0},null,null,null,null,{"$f":"Fakturering!I24","v":{"$error":"#REF!"}},null,{"$error":"#REF!"}]
[null,{"$f":"Fakturering!Q25","v":{"$error":"#REF!"}},{"$f":"ENG!B81","v":0},null,null,null,null,{"$f":"Fakturering!I25","v":{"$error":"#REF!"}},null,{"$error":"#REF!"}]
[null,{"$f":"Fakturering!Q26","v":{"$error":"#REF!"}},{"$f":"ENG!B82","v":0},null,null,null,null,{"$f":"Fakturering!I26","v":{"$error":"#REF!"}},null,{"$error":"#REF!"}]
[null,{"$f":"Fakturering!Q27","v":{"$error":"#REF!"}},{"$f":"ENG!B83","v":0},null,null,null,null,{"$f":"Fakturering!I27","v":{"$error":"#REF!"}},null,{"$error":"#REF!"}]
[null,{"$f":"Fakturering!Q28","v":{"$error":"#REF!"}},{"$f":"ENG!B84","v":0},null,null,null,null,{"$f":"Fakturering!I28","v":{"$error":"#REF!"}},null,{"$error":"#REF!"}]
[null,{"$f":"Fakturering!Q29","v":{"$error":"#REF!"}},{"$f":"ENG!B85","v":0},null,null,null,null,{"$f":"Fakturering!I29","v":{"$error":"#REF!"}},null,{"$error":"#REF!"}]
[null,"Extra Service"]
[null,{"$f":"Fakturering!H32","v":0},"Extra bed"]
[null,{"$f":"Fakturering!H33","v":0},"Extra cleaning"]
[]
[null,null,null,null,null,null,null,null,null,"Total",{"$f":"+J16","v":"DDK"}]
[null,"Terms of payment:  Net cash",null,null,null,null,null,null,null,{"$f":"SUMIF(J17:J26,\"<>\"&\"#I/T\")+(J28+J29+J30+J31+J32+J33+J34+J35+J36+J37)","v":{"$error":"#REF!"}}]
[]
[]
[null,"Customers copy"]
[null,"Copy for accounting "]
[null,"Copy for accounting of payment"]